BDBM166660 4-(4-(1H-pyrrole-2-carboxamido)phenylamino)-4-oxobutanoate (19)
SMILES [O-]C(=O)CCC(=O)Nc1ccc(NC(=O)c2ccc[nH]2)cc1
InChI Key InChIKey=ZPPIZZZIESZFHX-UHFFFAOYSA-M
Data  2 IC50
  Tab Delimited (TSV)   2D SDfile   Computed 3D by Vconf -m prep SDfile
Find this compound or compounds like it in BindingDB:
Activity Spreadsheet -- Enzyme Inhibition Constant Data from BindingDB
Found 2 hits for monomerid = 166660
TargetDNA gyrase subunit B(Staphylococcus aureus)
Birla Institute Of Technology
LigandPNGBDBM166660(4-(4-(1H-pyrrole-2-carboxamido)phenylamino)-4-oxob...)
Affinity DataIC50:  1.37E+4nMpH: 7.6 T: 2°C. Assay description: Supercoiling assay was performed using the commercially available kit (DNA gyrase supercoiling assay kit: SAS4001) from Inspiralis Pvt.limited, Norwi...
In DepthDetails ArticlePubMed
TargetDNA gyrase subunit B(Staphylococcus aureus)
Birla Institute Of Technology
LigandPNGBDBM166660(4-(4-(1H-pyrrole-2-carboxamido)phenylamino)-4-oxob...)
Affinity DataIC50:  4.25E+4nMpH: 7.5Assay Description:Initially, equimolar quantities of about 0.5µM each of E. coli gyraseA and S. aureus gyraseB were incubated for a period of 45 min with salmon sperm ...
In DepthDetails ArticlePubMed