BDBM175309 (E)-N'-(2,5-dihydroxybenzylidene)-4-(5,6-dimethyl-1H-benzo[d]imidazol-2-yl) benzohydrazide (4)
SMILES Cc1cc2nc([nH]c2cc1C)-c1ccc(cc1)C(=O)N\N=C\c1cc(O)ccc1O
InChI Key InChIKey=AAMHMYZKXJAFQY-WYMPLXKRSA-N
Data  1 IC50
  Tab Delimited (TSV)   2D SDfile   Computed 3D by Vconf -m prep SDfile
Find this compound or compounds like it in BindingDB:
Activity Spreadsheet -- Enzyme Inhibition Constant Data from BindingDB
Found 1 hit for monomerid = 175309
TargetOligo-1,6-glucosidase IMA1(Saccharomyces cerevisiae S288c (Baker's yeast))
Universiti Teknologi Mara (Uitm)
LigandPNGBDBM175309((E)-N'-(2,5-dihydroxybenzylidene)-4-(5,6-dimet...)
Affinity DataIC50:  8.74E+3nMpH: 6.8Assay Description:The enzyme inhibition was evaluated according to the method previously reported by Rahim et al. [25] with slight modification. Various concentration ...
In DepthDetails ArticlePubMed