BDBM175381 1,3-Dimethyl-8-[3-{2-(hexamethyleneimin-1-yl)-2-oxoethoxy}-phenyl]xanthine (14e, RB-376)
SMILES Cn1c2nc([nH]c2c(=O)n(C)c1=O)-c1cccc(OCC(=O)N2CCCCCC2)c1
InChI Key InChIKey=BHFXZRQADPNPPA-UHFFFAOYSA-N
Data  4 KI
  Tab Delimited (TSV)   2D SDfile   Computed 3D by Vconf -m prep SDfile
Find this compound or compounds like it in BindingDB:
Activity Spreadsheet -- Enzyme Inhibition Constant Data from BindingDB
Found 4 hits for monomerid = 175381
TargetAdenosine receptor A2a(Homo sapiens (Human))
Panjab University
LigandPNGBDBM175381(1,3-Dimethyl-8-[3-{2-(hexamethyleneimin-1-yl)-2-ox...)
Affinity DataKi:  226nM. Assay description: Dissociation constants at A1, A2A and A3 receptors (Ki-values) were determined in radioligand competition experiments as reported earlier [19,20]. Al...
In DepthDetails ArticlePubMed
TargetAdenosine receptor A1(Homo sapiens (Human))
Panjab University
LigandPNGBDBM175381(1,3-Dimethyl-8-[3-{2-(hexamethyleneimin-1-yl)-2-ox...)
Affinity DataKi:  2.43E+3nM. Assay description: Dissociation constants at A1, A2A and A3 receptors (Ki-values) were determined in radioligand competition experiments as reported earlier [19,20]. Al...
In DepthDetails ArticlePubMed
TargetAdenosine receptor A3 [I248L](Homo sapiens (Human))
Panjab University
LigandPNGBDBM175381(1,3-Dimethyl-8-[3-{2-(hexamethyleneimin-1-yl)-2-ox...)
Affinity DataKi:  3.69E+3nM. Assay description: Dissociation constants at A1, A2A and A3 receptors (Ki-values) were determined in radioligand competition experiments as reported earlier [19,20]. Al...
In DepthDetails ArticlePubMed
TargetAdenosine receptor A2b(Homo sapiens (Human))
Panjab University
LigandPNGBDBM175381(1,3-Dimethyl-8-[3-{2-(hexamethyleneimin-1-yl)-2-ox...)
Affinity DataKi:  6.28E+3nM. Assay description: Dissociation constants at A1, A2A and A3 receptors (Ki-values) were determined in radioligand competition experiments as reported earlier [19,20]. Al...
In DepthDetails ArticlePubMed