BDBM180951 US9133187, I-62
SMILES CC(C)Nc1ncc2CCN(Cc2n1)C(=O)N[C@H]([C@H](O)CO)c1ccc(Cl)c(Cl)c1
InChI Key InChIKey=JJSQKTFTIBTJKQ-MSOLQXFVSA-N
Data  1 IC50
  Tab Delimited (TSV)   2D SDfile   Computed 3D by Vconf -m prep SDfile
Find this compound or compounds like it in BindingDB:
Activity Spreadsheet -- Enzyme Inhibition Constant Data from BindingDB
Found 1 hit for monomerid = 180951
TargetMitogen-activated protein kinase 1(Homo sapiens (Human))
Array Biopharma
US Patent
LigandPNGBDBM180951(US9133187, I-62)
Affinity DataIC50:  2.40nMpH: 7.3Assay Description:Compounds were tested in an enzymatic assay using human ERK-2 (Mitogen Activated Kinase 1), recombinantly expressed as an n-terminal 6-His fusion pro...
In DepthDetails US Patent