BDBM180960 US9133187, I-93
SMILES CC(C)Nc1ncc2CCN(Cc2n1)C(=O)NC1(CCNCC1)c1ccc(Cl)c(Cl)c1
InChI Key InChIKey=LEZRHEBNHXYXGF-UHFFFAOYSA-N
Data  1 IC50
  Tab Delimited (TSV)   2D SDfile   Computed 3D by Vconf -m prep SDfile
Find this compound or compounds like it in BindingDB:
Activity Spreadsheet -- Enzyme Inhibition Constant Data from BindingDB
Found 1 hit for monomerid = 180960
TargetMitogen-activated protein kinase 1(Homo sapiens (Human))
Array Biopharma
US Patent
LigandPNGBDBM180960(US9133187, I-93)
Affinity DataIC50:  3.80nMpH: 7.3Assay Description:Compounds were tested in an enzymatic assay using human ERK-2 (Mitogen Activated Kinase 1), recombinantly expressed as an n-terminal 6-His fusion pro...
In DepthDetails US Patent