BDBM180974 US9133187, I-149
SMILES C[C@@H](CO)Nc1cc2CN(CCc2cn1)C(=O)N[C@H](C)c1ccc(Cl)c(Cl)c1
InChI Key InChIKey=ZNGYJSFEQYEVQE-QWHCGFSZSA-N
Data  1 IC50
  Tab Delimited (TSV)   2D SDfile   Computed 3D by Vconf -m prep SDfile
Find this compound or compounds like it in BindingDB:
Activity Spreadsheet -- Enzyme Inhibition Constant Data from BindingDB
Found 1 hit for monomerid = 180974
TargetMitogen-activated protein kinase 1(Homo sapiens (Human))
Array Biopharma
US Patent
LigandPNGBDBM180974(US9133187, I-149)
Affinity DataIC50:  3nMpH: 7.3Assay Description:Compounds were tested in an enzymatic assay using human ERK-2 (Mitogen Activated Kinase 1), recombinantly expressed as an n-terminal 6-His fusion pro...
Ligand InfoPC cidPC sid
In DepthDetails US Patent