BDBM184177 BDBM184272::US9150577, 29
SMILES C[C@H]1NC(=O)c2cc3ccc(cc3n2[C@H]1C)C(=O)Nc1cnn(Cc2ccccc2)c1
InChI Key InChIKey=JUHDVODXPWTTBZ-CVEARBPZSA-N
Data  2 IC50
  Tab Delimited (TSV)   2D SDfile   Computed 3D by Vconf -m prep SDfile
Find this compound or compounds like it in BindingDB:
Activity Spreadsheet -- Enzyme Inhibition Constant Data from BindingDB
Found 2 hits for monomerid = 184177
TargetRibosomal protein S6 kinase alpha-2(Homo sapiens (Human))
Boehringer Ingelheim International
US Patent
LigandPNGBDBM184177(BDBM184272 | US9150577, 29)
Affinity DataIC50:  65.5nMpH: 7.5Assay Description:Human RSK2 protein, purchased from Invitrogen, is used to measure kinase activity utilizing Kinase Glo Plus (Promega) a homogeneous assay technology,...
In DepthDetails US Patent
TargetRibosomal protein S6 kinase alpha-2(Homo sapiens (Human))
Boehringer Ingelheim International
US Patent
LigandPNGBDBM184177(BDBM184272 | US9150577, 29)
Affinity DataIC50:  1.90nMpH: 7.5Assay Description:Human RSK2 protein, purchased from Invitrogen, is used to measure kinase activity utilizing Kinase Glo Plus (Promega) a homogeneous assay technology,...
In DepthDetails US Patent