BDBM184188 US9150577, 41
SMILES O=C(Nc1nc2cc(ccc2[nH]1)C#N)c1ccc2cc3C(=O)NCCCn3c2c1
InChI Key InChIKey=SRYWIXAMNRCZBU-UHFFFAOYSA-N
Data  1 IC50
  Tab Delimited (TSV)   2D SDfile   Computed 3D by Vconf -m prep SDfile
Find this compound or compounds like it in BindingDB:
Activity Spreadsheet -- Enzyme Inhibition Constant Data from BindingDB
Found 1 hit for monomerid = 184188
TargetRibosomal protein S6 kinase alpha-2(Homo sapiens (Human))
Boehringer Ingelheim International
US Patent
LigandPNGBDBM184188(US9150577, 41)
Affinity DataIC50:  4.90nMpH: 7.5Assay Description:Human RSK2 protein, purchased from Invitrogen, is used to measure kinase activity utilizing Kinase Glo Plus (Promega) a homogeneous assay technology,...
In DepthDetails US Patent