BDBM185154 AC30341 (3)
SMILES Cc1ccsc1C(O)=O
InChI Key InChIKey=IFLKEBSJTZGCJG-UHFFFAOYSA-N
Data  1 IC50  1 Kd
PDB links: 5 PDB IDs match this monomer.
  Tab Delimited (TSV)   2D SDfile   Computed 3D by Vconf -m prep SDfile
Find this compound or compounds like it in BindingDB:
Activity Spreadsheet -- Enzyme Inhibition Constant Data from BindingDB
Found 2 hits for monomerid = 185154
TargetD-amino-acid oxidase(Homo sapiens (Human))
Tokushima University
Curated by ChEMBL
LigandPNGBDBM185154(AC30341 (3))
Affinity DataIC50: >1.00E+5nM. Assay description: Inhibition of human DAO using D-serine as substrate after 20 mins in presence of FAD
In DepthDetails ArticlePubMed
TargetQuinolone signal response protein(Pseudomonas aeruginosa PAO1)
Helmholtz-Institute For Pharmaceutical Research Saarland
LigandPNGBDBM185154(AC30341 (3))
Affinity DataKd:  1.96E+4nMT: 2°C. Assay description: ITC titrations were performed using an ITC200 instrument (Microcal Inc.,Malvern). DMSO stock solutions (20 mM) of fragments were diluted 1:20 (v/v) i...