BDBM188219 US9073941, 302::cid_16134267
SMILES Oc1cc(cc(O)c1O)C(=O)Oc1cc(cc(O)c1O)C(=O)OC[C@H]1O[C@H](OC(=O)c2cc(O)c(O)c(OC(=O)c3cc(O)c(O)c(O)c3)c2)[C@H](OC(=O)c2cc(O)c(O)c(OC(=O)c3cc(O)c(O)c(O)c3)c2)[C@@H](OC(=O)c2cc(O)c(O)c(OC(=O)c3cc(O)c(O)c(O)c3)c2)[C@@H]1OC(=O)c1cc(O)c(O)c(OC(=O)c2cc(O)c(O)c(O)c2)c1
InChI Key InChIKey=LRBQNJMCXXYXIU-NRMVVENXSA-N
Data  1 IC50  1 EC50
  Tab Delimited (TSV)   2D SDfile   Computed 3D by Vconf -m prep SDfile
Find this compound or compounds like it in BindingDB:
Activity Spreadsheet -- Enzyme Inhibition Constant Data from BindingDB
Found 2 hits for monomerid = 188219
TargetCystic fibrosis transmembrane conductance regulator(Homo sapiens (Human))
Southern Research Institute
Curated by PubChem BioAssay
LigandPNGBDBM188219(US9073941, 302 | cid_16134267)
Affinity DataEC50: >5.00E+4nM
In DepthDetails PCBioAssay
LigandPNGBDBM188219(US9073941, 302 | cid_16134267)
Affinity DataIC50:  450nMpH: 7.0Assay Description:Mtb PDH (Lpd+DlaT+AceE) is provided by Dr. Bryk Ruslana. The assay was performed in a manner similar to that described in Bryk et al., Biochemistry (...
In DepthDetails US Patent