BDBM188289 US9073941, 614
SMILES Cn1nc(nc2c1nc(=O)n(C)c2=O)-c1ccc(cc1)[N+]([O-])=O
InChI Key InChIKey=FJVNBUQKMTUTQQ-UHFFFAOYSA-N
Data  2 IC50
  Tab Delimited (TSV)   2D SDfile   Computed 3D by Vconf -m prep SDfile
Find this compound or compounds like it in BindingDB:
Activity Spreadsheet -- Enzyme Inhibition Constant Data from BindingDB
Found 2 hits for monomerid = 188289
LigandPNGBDBM188289(US9073941, 614)
Affinity DataIC50: <40nMpH: 7.0Assay Description:Mtb PDH (Lpd+DlaT+AceE) is provided by Dr. Bryk Ruslana. The assay was performed in a manner similar to that described in Bryk et al., Biochemistry (...
In DepthDetails US Patent
TargetDihydrolipoyl dehydrogenase(Mycobacterium tuberculosis)
Academia Sinica
US Patent
LigandPNGBDBM188289(US9073941, 614)
Affinity DataIC50: <40nMpH: 7.0Assay Description:The assay was performed in a manner similar to that described in Bryk et al., Biochemistry (2010) 49:1616-1627 and modified for an online robotics sc...
In DepthDetails US Patent