BDBM189823 US9174997, 43 (Diastereomer 1)
SMILES CC1=C([N+]#[C-])[C@H](NC(=O)N1c1cccc(c1)C(F)(F)F)c1ccc(cc1[S@](C)=O)C#N
InChI Key InChIKey=SMRWXARBIWIECD-KKIUXKEOSA-N
Data  1 IC50
  Tab Delimited (TSV)   2D SDfile   Computed 3D by Vconf -m prep SDfile
Find this compound or compounds like it in BindingDB:
Activity Spreadsheet -- Enzyme Inhibition Constant Data from BindingDB
Found 1 hit for monomerid = 189823
TargetNeutrophil elastase(Homo sapiens (Human))
Bayer Intellectual Property
US Patent
LigandPNGBDBM189823(US9174997, 43 (Diastereomer 1))
Affinity DataIC50:  0.300nMpH: 7.4 T: 2°C. Assay description: The potency of the compounds of the invention is ascertained in an in vitro inhibition assay. The HNE-mediated amidolytic cleavage of a suitable pept...
In DepthDetails US Patent