BDBM191052 US9181253, 112
SMILES O[C@H]1C[C@]2(C[C@H]2[C@H]1O)n1cnc2c(NC3CCCCCCC3)nc(Cl)nc12
InChI Key InChIKey=UVFJMANYMXKZFS-AEVLCDIHSA-N
Data  2 KI
  Tab Delimited (TSV)   2D SDfile   Computed 3D by Vconf -m prep SDfile
Find this compound or compounds like it in BindingDB:
Activity Spreadsheet -- Enzyme Inhibition Constant Data from BindingDB
Found 2 hits for monomerid = 191052
TargetAdenosine receptor A1(Homo sapiens (Human))
The United States Of America, As Represented By The Secretary, Department Of Health And Human Services
US Patent
LigandPNGBDBM191052(US9181253, 112)
Affinity DataKi:  760nM ΔG°:  -8.34kcal/molepH: 7.5 T: 2°C. Assay description: Radioligand binding assays at A1, A2A, and A3ARs were performed according to the procedures described previously. Each tube in the binding assay cont...
In DepthDetails US Patent
TargetAdenosine receptor A3 [I248L](Homo sapiens (Human))
The United States Of America, As Represented By The Secretary, Department Of Health And Human Services
US Patent
LigandPNGBDBM191052(US9181253, 112)
Affinity DataKi:  1.53E+3nM ΔG°:  -7.93kcal/molepH: 7.5 T: 2°C. Assay description: Radioligand binding assays at A1, A2A, and A3ARs were performed according to the procedures described previously. Each tube in the binding assay cont...
In DepthDetails US Patent