BDBM191066 US9181253, 128
SMILES OCc1cc(F)c(F)cc1CNc1nc(Cl)nc2n(cnc12)[C@]12C[C@H]1[C@@H](O)[C@@H](O)C2
InChI Key InChIKey=FCXFKNMITJNUQK-QUPAPELASA-N
Data  3 KI
  Tab Delimited (TSV)   2D SDfile   Computed 3D by Vconf -m prep SDfile
Find this compound or compounds like it in BindingDB:
Activity Spreadsheet -- Enzyme Inhibition Constant Data from BindingDB
Found 3 hits for monomerid = 191066
TargetAdenosine receptor A3 [I248L](Homo sapiens (Human))
The United States Of America, As Represented By The Secretary, Department Of Health And Human Services
US Patent
LigandPNGBDBM191066(US9181253, 128)
Affinity DataKi:  40.4nM ΔG°:  -10.1kcal/molepH: 7.5 T: 2°C. Assay description: Radioligand binding assays at A1, A2A, and A3ARs were performed according to the procedures described previously. Each tube in the binding assay cont...
In DepthDetails US Patent
TargetAdenosine receptor A1(Homo sapiens (Human))
The United States Of America, As Represented By The Secretary, Department Of Health And Human Services
US Patent
LigandPNGBDBM191066(US9181253, 128)
Affinity DataKi:  1.91E+3nM ΔG°:  -7.80kcal/molepH: 7.5 T: 2°C. Assay description: Radioligand binding assays at A1, A2A, and A3ARs were performed according to the procedures described previously. Each tube in the binding assay cont...
In DepthDetails US Patent
TargetAdenosine receptor A2a(Homo sapiens (Human))
The United States Of America, As Represented By The Secretary, Department Of Health And Human Services
US Patent
LigandPNGBDBM191066(US9181253, 128)
Affinity DataKi:  7.51E+3nM ΔG°:  -6.99kcal/molepH: 7.5 T: 2°C. Assay description: Radioligand binding assays at A1, A2A, and A3ARs were performed according to the procedures described previously. Each tube in the binding assay cont...
In DepthDetails US Patent