BDBM194845 US9206184, 26
SMILES COc1cc(C)cc2cc(sc12)-c1c(COC2CCC2)c(CN2CCNCC2)n2ncnc(N)c12
InChI Key InChIKey=GEMHNNGOAKEHGC-UHFFFAOYSA-N
Data  2 IC50
  Tab Delimited (TSV)   2D SDfile   Computed 3D by Vconf -m prep SDfile
Find this compound or compounds like it in BindingDB:
Activity Spreadsheet -- Enzyme Inhibition Constant Data from BindingDB
Found 2 hits for monomerid = 194845
TargetFibroblast growth factor receptor 3(Homo sapiens (Human))
Bayer Intellectual Property
US Patent
LigandPNGBDBM194845(US9206184, 26)
Affinity DataIC50:  4.90nMpH: 7.0 T: 2°C. Assay description: For the assay, 50 nl of each stock solution of the test compound in DMSO was pipetted into a black, low-volume 384-well microtiter plate (Greiner Bio...
Ligand InfoPC cidPC sid
In DepthDetails US Patent
TargetFibroblast growth factor receptor 1(Homo sapiens (Human))
Bayer Intellectual Property
US Patent
LigandPNGBDBM194845(US9206184, 26)
Affinity DataIC50:  0.900nMpH: 7.0 T: 2°C. Assay description: For the assay, 50 nl of each stock solution of the test compound in DMSO was pipetted into a black, low-volume 384-well microtiter plate (Greiner Bio...
Ligand InfoPC cidPC sid
In DepthDetails US Patent