BDBM194963 US9206198, 18
SMILES CO[C@@H](CN1CC2CCC(C1)CC1(CCN(C3=CC(=O)OC3)C1=O)C2)c1ccc2C(=O)OCc2c1C
InChI Key InChIKey=QDBQOPIPWGXYCY-PFBJZOMCSA-N
Data  2 IC50
  Tab Delimited (TSV)   2D SDfile   Computed 3D by Vconf -m prep SDfile
Find this compound or compounds like it in BindingDB:
Activity Spreadsheet -- Enzyme Inhibition Constant Data from BindingDB
Found 2 hits for monomerid = 194963
TargetATP-sensitive inward rectifier potassium channel 1(Homo sapiens (Human))
Merck Sharp & Dohme
US Patent
LigandPNGBDBM194963(US9206198, 18)
Affinity DataIC50:  4nMpH: 7.4 T: 2°C. Assay description: Block of Kir1.1 (ROMK1) currents was examined by whole cell voltage clamp (Hamill et. al. Pfluegers Archives 391:85-100 (1981)) using the IonWorks ...
Ligand InfoPC cidPC sid
In DepthDetails US Patent
TargetATP-sensitive inward rectifier potassium channel 1(Homo sapiens (Human))
Merck Sharp & Dohme
US Patent
LigandPNGBDBM194963(US9206198, 18)
Affinity DataIC50:  20nMT: 2°C. Assay description: The ROMK channel functional thallium flux assay is performed in 384 wells, using the FLIPR-Tetra instrument. HEK-hKir1.1 cells are seeded in Poly-D...
Ligand InfoPC cidPC sid
In DepthDetails US Patent