BDBM19577 (2S)-3-cyclohexyl-2-({4-[(4,6-dimethylpyrimidin-2-yl)amino]phenyl}formamido)-N-{2-[(4-methoxyphenyl)amino]ethyl}propanamide::arylaminoethyl amide, 15
SMILES COc1ccc(NCCNC(=O)[C@H](CC2CCCCC2)NC(=O)c2ccc(Nc3nc(C)cc(C)n3)cc2)cc1
InChI Key InChIKey=PRGVGZFPDSRIPJ-NDEPHWFRSA-N
Data  3 KI
  Tab Delimited (TSV)   2D SDfile   Computed 3D by Vconf -m prep SDfile
Find this compound or compounds like it in BindingDB:
Activity Spreadsheet -- Enzyme Inhibition Constant Data from BindingDB
Found 3 hits for monomerid = 19577
TargetCathepsin S(Homo sapiens (Human))
Gnf
LigandPNGBDBM19577((2S)-3-cyclohexyl-2-({4-[(4,6-dimethylpyrimidin-2-...)
Affinity DataKi:  2nM. Assay description: The recombinant human cathepsin enzyme was preincubated with inhibitor for 20 minutes prior to addition of substrate. The substrate hydrolysis was mo...
Ligand InfoPC cidPC sid
In DepthDetails ArticlePubMed
TargetProcathepsin L(Homo sapiens (Human))
Gnf
LigandPNGBDBM19577((2S)-3-cyclohexyl-2-({4-[(4,6-dimethylpyrimidin-2-...)
Affinity DataKi:  176nM. Assay description: The recombinant human cathepsin enzyme was preincubated with inhibitor for 20 minutes prior to addition of substrate. The substrate hydrolysis was mo...
Ligand InfoPC cidPC sid
In DepthDetails ArticlePubMed
TargetCathepsin K(Homo sapiens (Human))
Gnf
LigandPNGBDBM19577((2S)-3-cyclohexyl-2-({4-[(4,6-dimethylpyrimidin-2-...)
Affinity DataKi:  438nM. Assay description: The recombinant human cathepsin enzyme was preincubated with inhibitor for 20 minutes prior to addition of substrate. The substrate hydrolysis was mo...
Ligand InfoPC cidPC sid
In DepthDetails ArticlePubMed