BDBM19723 (2R)-2-(morpholin-4-ylcarbonylamino)-3-(phenylmethane)sulfonyl-N-[(2S)-1-{[4-(trifluoromethoxy)phenyl]amino}propan-2-yl]propanamide::arylaminoethyl amide deriv. 37
SMILES C[C@@H](CNc1ccc(OC(F)(F)F)cc1)NC(=O)[C@H](CS(=O)(=O)Cc1ccccc1)NC(=O)N1CCOCC1
InChI Key InChIKey=LIOLGHUQUQDMDF-AVRDEDQJSA-N
Data  3 KI
PDB links: 2 PDB IDs match this monomer.
  Tab Delimited (TSV)   2D SDfile   Computed 3D by Vconf -m prep SDfile
Find this compound or compounds like it in BindingDB:
Activity Spreadsheet -- Enzyme Inhibition Constant Data from BindingDB
Found 3 hits for monomerid = 19723
TargetCathepsin S(Homo sapiens (Human))
Gnf
LigandPNGBDBM19723((2R)-2-(morpholin-4-ylcarbonylamino)-3-(phenylmeth...)
Affinity DataKi:  32nM ΔG°:  -10.6kcal/molepH: 5.5 T: 2°C. Assay description: The recombinant human cathepsin enzyme was preincubated with inhibitor for 20 minutes prior to addition of substrate. The substrate hydrolysis was mo...
TargetProcathepsin L(Homo sapiens (Human))
Gnf
LigandPNGBDBM19723((2R)-2-(morpholin-4-ylcarbonylamino)-3-(phenylmeth...)
Affinity DataKi: >3.00E+4nM. Assay description: The recombinant human cathepsin enzyme was preincubated with inhibitor for 20 minutes prior to addition of substrate. The substrate hydrolysis was mo...
In DepthDetails ArticlePubMed
TargetCathepsin K(Homo sapiens (Human))
Gnf
LigandPNGBDBM19723((2R)-2-(morpholin-4-ylcarbonylamino)-3-(phenylmeth...)
Affinity DataKi: >1.00E+5nM. Assay description: The recombinant human cathepsin enzyme was preincubated with inhibitor for 20 minutes prior to addition of substrate. The substrate hydrolysis was mo...
In DepthDetails ArticlePubMed