BDBM198005 US9221790, 15
SMILES COc1cc(N)c(Cl)cc1C(=O)NCC1CCNC(Cc2c[nH]c3ccccc23)C1
InChI Key
Data  1 IC50
  Tab Delimited (TSV)   2D SDfile   Computed 3D by Vconf -m prep SDfile
Find this compound or compounds like it in BindingDB:
Activity Spreadsheet -- Enzyme Inhibition Constant Data from BindingDB
Found 1 hit for monomerid = 198005
Target5-hydroxytryptamine receptor 4(Homo sapiens (Human))
Dong-A Pharm.
US Patent
LigandPNGBDBM198005(US9221790, 15)
Affinity DataIC50:  0.00200nM. Assay description: The binding affinity of the compounds for a human 5-HT4 receptor was assayed according to the method as disclosed in the literature [Wyngaert et al.,...
Ligand InfoPC cidPC sid
In DepthDetails US Patent