BDBM200237 AB00549093-03::cid_4965103
SMILES O=C(Nc1nc(-c2cccs2)c(s1)-c1cccs1)C1CCCC1
InChI Key InChIKey=ULWDFFBLBSIUEA-UHFFFAOYSA-N
Data  1 EC50
  Tab Delimited (TSV)   2D SDfile   Computed 3D by Vconf -m prep SDfile
Find this compound or compounds like it in BindingDB:
Activity Spreadsheet -- Enzyme Inhibition Constant Data from BindingDB
Found 1 hit for monomerid = 200237
TargetCystic fibrosis transmembrane conductance regulator(Homo sapiens (Human))
Southern Research Institute
Curated by PubChem BioAssay
LigandPNGBDBM200237(AB00549093-03 | cid_4965103)
Affinity DataEC50: >5.50E+4nM
In DepthDetails PCBioAssay