BDBM200246 AB00984213-01::cid_2697355
SMILES Brc1ccc(\C=C2/COc3ccccc3C2=O)s1
InChI Key InChIKey=SYSJXIPLEHCAAV-VQHVLOKHSA-N
Data  1 EC50
  Tab Delimited (TSV)   2D SDfile   Computed 3D by Vconf -m prep SDfile
Find this compound or compounds like it in BindingDB:
Activity Spreadsheet -- Enzyme Inhibition Constant Data from BindingDB
Found 1 hit for monomerid = 200246
TargetCystic fibrosis transmembrane conductance regulator(Homo sapiens (Human))
Southern Research Institute
Curated by PubChem BioAssay
LigandPNGBDBM200246(AB00984213-01 | cid_2697355)
Affinity DataEC50: >6.20E+4nM
Ligand InfoPC cidPC sid
In DepthDetails PCBioAssay