BDBM200248 AB01001062-01::cid_42909519
SMILES C(C1CCCO1)N1CCN(CC1)c1nc(nc2scc(-c3ccccc3)c12)-c1ccccn1
InChI Key InChIKey=XKQKYUNZSKVFRB-UHFFFAOYSA-N
Data  1 EC50
  Tab Delimited (TSV)   2D SDfile   Computed 3D by Vconf -m prep SDfile
Find this compound or compounds like it in BindingDB:
Activity Spreadsheet -- Enzyme Inhibition Constant Data from BindingDB
Found 1 hit for monomerid = 200248
TargetCystic fibrosis transmembrane conductance regulator(Homo sapiens (Human))
Southern Research Institute
Curated by PubChem BioAssay
LigandPNGBDBM200248(AB01001062-01 | cid_42909519)
Affinity DataEC50: >4.40E+4nM
In DepthDetails PCBioAssay