BDBM200270 AB00985144-01::cid_17549911
SMILES Cn1c(nc2ccccc12)-c1c(N)n(Cc2cccnc2)c2nc(C#N)c(nc12)C#N
InChI Key InChIKey=DDUBZDSIKQPOSK-UHFFFAOYSA-N
Data  1 EC50
  Tab Delimited (TSV)   2D SDfile   Computed 3D by Vconf -m prep SDfile
Find this compound or compounds like it in BindingDB:
Activity Spreadsheet -- Enzyme Inhibition Constant Data from BindingDB
Found 1 hit for monomerid = 200270
TargetCystic fibrosis transmembrane conductance regulator(Homo sapiens (Human))
Southern Research Institute
Curated by PubChem BioAssay
LigandPNGBDBM200270(AB00985144-01 | cid_17549911)
Affinity DataEC50: >4.90E+4nM
In DepthDetails PCBioAssay