BDBM209558 US9271969, 46
SMILES CC(C)(C)c1ccc(CNC(=O)c2cn3cc(sc3n2)-c2ccc(cc2)[C@H]2CC[C@H](CC(O)=O)CC2)cc1
InChI Key InChIKey=UJIFYDZPGHKMSU-AQYVVDRMSA-N
Data  2 IC50
  Tab Delimited (TSV)   2D SDfile   Computed 3D by Vconf -m prep SDfile
Find this compound or compounds like it in BindingDB:
Activity Spreadsheet -- Enzyme Inhibition Constant Data from BindingDB
Found 2 hits for monomerid = 209558
TargetDiacylglycerol O-acyltransferase 1(Mus musculus (mouse))
Kainos Medicine
US Patent
LigandPNGBDBM209558(US9271969, 46)
Affinity DataIC50: <50nMpH: 7.4 T: 2°C. Assay description:  Assay buffer [20 mM HEPES (pH 7.4), 100 mM MgCl2 and 0.04% bovine serum albumin (BSA)] containing 500 uM of enzyme substrate (didecanoyl glycerol) ...
Ligand InfoPC cidPC sid
In DepthDetails US Patent
TargetDiacylglycerol O-acyltransferase 1(Homo sapiens (Human))
Kainos Medicine
US Patent
LigandPNGBDBM209558(US9271969, 46)
Affinity DataIC50: <1nMpH: 7.4 T: 2°C. Assay description:  Assay buffer [20 mM HEPES (pH 7.4), 100 mM MgCl2 and 0.04% bovine serum albumin (BSA)] containing 500 uM of enzyme substrate (didecanoyl glycerol) ...
Ligand InfoPC cidPC sid
In DepthDetails US Patent