BDBM212270 6-(6-amino-5-methylpyrazin-2-yl)-N-(4-(4-(oxetan-3-yl)piperazin-1-yl)phenyl)imidazo[1,2-a]pyrazin-8-amine:::US10828299, Example Ex.-1::US10342794, Example Ex.-1::US11517570, Example Ex.-1::US9290505, Ex.-1::US9504684, Ex.-1::US9931338, Ex.-1
SMILES Cc1ncc(nc1N)-c1cn2ccnc2c(Nc2ccc(cc2)N2CCN(CC2)C2COC2)n1
InChI Key InChIKey=ZRYZTVGYFNTCJF-UHFFFAOYSA-N
Data  7 IC50
  Tab Delimited (TSV)   2D SDfile   Computed 3D by Vconf -m prep SDfile
Find this compound or compounds like it in BindingDB:
Activity Spreadsheet -- Enzyme Inhibition Constant Data from BindingDB
Found 7 hits for monomerid = 212270
TargetCD63 antigen(Homo sapiens (Human))
Gilead Sciences
US Patent
LigandPNGBDBM212270(6-(6-amino-5-methylpyrazin-2-yl)-N-(4-(4-(oxetan-3...)
Affinity DataIC50:  51nMpH: 7.0Assay Description:Syk activity was measured using KinEASE (Cisbio), a time-resolved fluorescence resonance energy transfer (TR-FRET) immunoassay. In this assay, Syk-ca...
Ligand InfoPC cidPC sid
In DepthDetails US Patent
TargetTyrosine-protein kinase SYK(Homo sapiens (Human))
Gilead Sciences
US Patent
LigandPNGBDBM212270(6-(6-amino-5-methylpyrazin-2-yl)-N-(4-(4-(oxetan-3...)
Affinity DataIC50:  6.20nMpH: 7.0Assay Description:Syk activity was measured using KinEASE (Cisbio), a time-resolved fluorescence resonance energy transfer (TR-FRET) immunoassay. In this assay, Syk-ca...
Ligand InfoPC cidPC sid
In DepthDetails US Patent
TargetTyrosine-protein kinase SYK(Homo sapiens (Human))
Gilead Sciences
US Patent
LigandPNGBDBM212270(6-(6-amino-5-methylpyrazin-2-yl)-N-(4-(4-(oxetan-3...)
Affinity DataIC50:  6.20nMpH: 7.0 T: 2°C. Assay description: Syk activity was measured using KinEASE (Cisbio), a time-resolved fluorescence resonance energy transfer (TR-FRET) immunoassay. In this assay, Syk-ca...
Ligand InfoPC cidPC sid
In DepthDetails US Patent
TargetTyrosine-protein kinase SYK(Homo sapiens (Human))
Gilead Sciences
US Patent
LigandPNGBDBM212270(6-(6-amino-5-methylpyrazin-2-yl)-N-(4-(4-(oxetan-3...)
Affinity DataIC50:  6.20nM. Assay description: Syk activity was measured using KinEASE (Cisbio), a time-resolved fluorescence resonance energy transfer (TR-FRET) immunoassay. In this assay, Syk-ca...
Ligand InfoPC cidPC sid
In DepthDetails US Patent
TargetTyrosine-protein kinase SYK(Homo sapiens (Human))
Gilead Sciences
US Patent
LigandPNGBDBM212270(6-(6-amino-5-methylpyrazin-2-yl)-N-(4-(4-(oxetan-3...)
Affinity DataIC50:  6.20nM. Assay description: Syk activity was measured using KinEASE (Cisbio), a time-resolved fluorescence resonance energy transfer (TR-FRET) immunoassay. In this assay, Syk-ca...
Ligand InfoPC cidPC sid
In DepthDetails US Patent
TargetTyrosine-protein kinase SYK(Homo sapiens (Human))
Gilead Sciences
US Patent
LigandPNGBDBM212270(6-(6-amino-5-methylpyrazin-2-yl)-N-(4-(4-(oxetan-3...)
Affinity DataIC50:  6.20nM. Assay description: Syk activity was measured using KinEASE (Cisbio), a time-resolved fluorescence resonance energy transfer (TR-FRET) immunoassay. In this assay, Syk-ca...
Ligand InfoPC cidPC sid
In DepthDetails US Patent
TargetTyrosine-protein kinase SYK(Homo sapiens (Human))
Gilead Sciences
US Patent
LigandPNGBDBM212270(6-(6-amino-5-methylpyrazin-2-yl)-N-(4-(4-(oxetan-3...)
Affinity DataIC50:  6.20nM. Assay description: Syk activity was measured using KinEASE (Cisbio), a time-resolved fluorescence resonance energy transfer (TR-FRET) immunoassay. In this assay, Syk-ca...
Ligand InfoPC cidPC sid
In DepthDetails US Patent