BDBM212278 :US9290505, 6-(3-aminophenyl)-N-(3,4-dimethoxyphenyl)imidazo[1,2-a]pyrazin-8-amine::US11517570, Example Kn.-2::US9504684, 6-(3-aminophenyl)-N-(3,4-dimethoxyphenyl)imidazo[1,2-a]pyrazin-8-amine
SMILES COc1ccc(Nc2nc(cn3ccnc23)-c2cccc(N)c2)cc1OC
InChI Key InChIKey=YWXFWBFYSNQVQH-UHFFFAOYSA-N
Data  4 IC50
  Tab Delimited (TSV)   2D SDfile   Computed 3D by Vconf -m prep SDfile
Find this compound or compounds like it in BindingDB:
Activity Spreadsheet -- Enzyme Inhibition Constant Data from BindingDB
Found 4 hits for monomerid = 212278
TargetCD63 antigen(Homo sapiens (Human))
Gilead Sciences
US Patent
LigandPNGBDBM212278(US11517570, Example Kn.-2: | US9290505, 6-(3-amino...)
Affinity DataIC50:  809nMpH: 7.0Assay Description:Syk activity was measured using KinEASE (Cisbio), a time-resolved fluorescence resonance energy transfer (TR-FRET) immunoassay. In this assay, Syk-ca...
Ligand InfoPC cidPC sid
In DepthDetails US Patent
TargetTyrosine-protein kinase SYK(Homo sapiens (Human))
Kronos Bio
US Patent
LigandPNGBDBM212278(US11517570, Example Kn.-2: | US9290505, 6-(3-amino...)
Affinity DataIC50:  188nM. Assay description: Syk activity was measured using KinEASE (Cisbio), a time-resolved fluorescence resonance energy transfer (TR-FRET) immunoassay. In this assay, Syk-ca...
Ligand InfoPC cidPC sid
In DepthDetails US Patent
TargetTyrosine-protein kinase SYK(Homo sapiens (Human))
Kronos Bio
US Patent
LigandPNGBDBM212278(US11517570, Example Kn.-2: | US9290505, 6-(3-amino...)
Affinity DataIC50:  188nMpH: 7.0 T: 2°C. Assay description: Syk activity was measured using KinEASE (Cisbio), a time-resolved fluorescence resonance energy transfer (TR-FRET) immunoassay. In this assay, Syk-ca...
Ligand InfoPC cidPC sid
In DepthDetails US Patent
TargetTyrosine-protein kinase SYK(Homo sapiens (Human))
Kronos Bio
US Patent
LigandPNGBDBM212278(US11517570, Example Kn.-2: | US9290505, 6-(3-amino...)
Affinity DataIC50:  188nMpH: 7.0Assay Description:Syk activity was measured using KinEASE (Cisbio), a time-resolved fluorescence resonance energy transfer (TR-FRET) immunoassay. In this assay, Syk-ca...
Ligand InfoPC cidPC sid
In DepthDetails US Patent