BDBM213231 3,4,5,6-Inositol tetrakisphosphate (3,4,5,6-IP4)
SMILES O[C@H]1[C@@H](O)[C@H](OP([O-])([O-])=O)[C@@H](OP([O-])([O-])=O)[C@H](OP([O-])([O-])=O)[C@H]1OP([O-])([O-])=O
InChI Key InChIKey=MRVYFOANPDTYBY-UZAAGFTCSA-F
Data  1 Kd  1 ITC
  Tab Delimited (TSV)   2D SDfile   Computed 3D by Vconf -m prep SDfile
Find this compound or compounds like it in BindingDB:
Activity Spreadsheet -- Enzyme Inhibition Constant Data from BindingDB
Found 1 hit for monomerid = 213231
TargetInositol-pentakisphosphate 2-kinase(Arabidopsis thaliana (Mouse-ear cress))
Mcgill University
LigandPNGBDBM213231(3,4,5,6-Inositol tetrakisphosphate (3,4,5,6-IP4))
Affinity DataKd:  7.52E+3nMpH: 7.5 T: 2°C. Assay description: Experiments were performed on a MicroCal iTC200 titration calorimeter (GE Healthcare). Wild-type IPK1 was purified and dialyzed into ITC buffer conta...
In DepthDetails ArticlePubMed
Activity Spreadsheet -- ITC Data from BindingDB
Found 1 hit for monomerid = 213231
CellInositol 1,3,4,5,6-pentakisphosphate 2-kinase (IPK1)(Arabidopsis thaliana (Mouse-ear cress))
Mcgill University
SyringePNGBDBM213231(3,4,5,6-Inositol tetrakisphosphate (3,4,5,6-IP4))
ITC DataΔG°: -6.97kcal/mole −TΔS°: 11.3kcal/mole ΔH°: -18.3kcal/mole logk: 1.30E+5
pH: 7.5 T: 25.00°C
In DepthDetails ArticlePubMed