BDBM21454 2-[({1-[(benzyloxy)carbonyl]pyrrolidin-2-yl}(hydroxy)phosphoryl)methyl]-4-methylpentanoic acid::Phosphinic Peptide Inhibitor, 13
SMILES CC(C)CC(CP(O)(O)C1=CCCN1C(=O)OCc1ccccc1)C(O)=O
InChI Key InChIKey=WTTYTDYQCIMIAP-UHFFFAOYSA-N
Data  1 KI
  Tab Delimited (TSV)   2D SDfile   Computed 3D by Vconf -m prep SDfile
Find this compound or compounds like it in BindingDB:
Activity Spreadsheet -- Enzyme Inhibition Constant Data from BindingDB
Found 1 hit for monomerid = 21454
TargetAngiotensin-converting enzyme 2(Homo sapiens (Human))
University Of Athens
LigandPNGBDBM21454(2-[({1-[(benzyloxy)carbonyl]pyrrolidin-2-yl}(hydro...)
Affinity DataKi:  300nM ΔG°:  -8.89kcal/molepH: 6.8 T: 2°C. Assay description: Continuous assays were performed by recording the fluorescence increase at 405 nm (excitation@ 320 nm) induced by the cleavage of fluorogenic substra...
In DepthDetails ArticlePubMed