BDBM215796 US9303005, TF
SMILES Cc1ccc(N\C=C2\c3oc4c(Cl)c(Cl)c(O)cc4c3CCC2=O)cc1
InChI Key InChIKey=ZCTFVCJEVPAGSA-NTEUORMPSA-N
Data  1 IC50
PDB links: 1 PDB ID matches this monomer.
  Tab Delimited (TSV)   2D SDfile   Computed 3D by Vconf -m prep SDfile
Find this compound or compounds like it in BindingDB:
Activity Spreadsheet -- Enzyme Inhibition Constant Data from BindingDB
Found 1 hit for monomerid = 215796
TargetCasein kinase II subunit alpha(Homo sapiens (Human))
TBA
US Patent
LigandPNGBDBM215796(US9303005, TF)
Affinity DataIC50:  30nM. Assay description: IC50 values were obtained from capillary electrophoretic inhibition test.
Ligand InfoPC cidPC sidPDB