BDBM220980 US9302996, 95-6
SMILES Cc1cc(OCC(C)(C)C(O)=O)ncc1-c1cnc(cn1)-c1nc(c[nH]1)C(F)(F)F
InChI Key InChIKey=VWZQMRROJVQILU-UHFFFAOYSA-N
Data  1 IC50
  Tab Delimited (TSV)   2D SDfile   Computed 3D by Vconf -m prep SDfile
Find this compound or compounds like it in BindingDB:
Activity Spreadsheet -- Enzyme Inhibition Constant Data from BindingDB
Found 1 hit for monomerid = 220980
TargetDiacylglycerol O-acyltransferase 1(Homo sapiens (Human))
Mitsubishi Tanabe Pharma
US Patent
LigandPNGBDBM220980(US9302996, 95-6)
Affinity DataIC50:  1.70nMpH: 7.4 T: 2°C. Assay description: As a buffer to be used in the enzymatic reaction of DGAT1, 100 mM Tris-HCl (pH 7.4), 200 mM Sucrose, 20 mM MgCl2, 0.125% Bovine Serum Albumin (BSA) w...
Ligand InfoPC cidPC sid
In DepthDetails US Patent