BDBM23236 1,2,5-oxadiazole, OXD4::1,2,5-oxadiazole-3-carboxylic acid
SMILES OC(=O)c1cnon1
InChI Key InChIKey=JBLHCUQCDKBPGY-UHFFFAOYSA-N
Data  2 IC50
  Tab Delimited (TSV)   2D SDfile   Computed 3D by Vconf -m prep SDfile
Find this compound or compounds like it in BindingDB:
Activity Spreadsheet -- Enzyme Inhibition Constant Data from BindingDB
Found 2 hits for monomerid = 23236
TargetL-lactate dehydrogenase B chain(Homo sapiens (Human))
University Of Bristol
LigandPNGBDBM23236(1,2,5-oxadiazole, OXD4 | 1,2,5-oxadiazole-3-carbox...)
Affinity DataIC50: >2.00E+5nM. Assay description: An LDH enzymatic assay developed for high throughput format was used. The dehydrogenase reaction was run in the lactate to pyruvate direction and cou...
In DepthDetails ArticlePubMed
TargetL-lactate dehydrogenase(Plasmodium falciparum)
University Of Bristol
LigandPNGBDBM23236(1,2,5-oxadiazole, OXD4 | 1,2,5-oxadiazole-3-carbox...)
Affinity DataIC50: >2.00E+5nMpH: 7.5 T: 2°C. Assay description: An LDH enzymatic assay developed for high throughput format was used. The dehydrogenase reaction was run in the lactate to pyruvate direction and cou...
In DepthDetails ArticlePubMed