BDBM23256 1-benzyl-4-hydroxy-1H-1,2,3-triazole-5-carboxylic acid::Triazole, TRZ3
SMILES OC(=O)c1c(O)nnn1Cc1ccccc1
InChI Key InChIKey=FMHACHNDHUUNOY-UHFFFAOYSA-N
Data  2 IC50
  Tab Delimited (TSV)   2D SDfile   Computed 3D by Vconf -m prep SDfile
Find this compound or compounds like it in BindingDB:
Activity Spreadsheet -- Enzyme Inhibition Constant Data from BindingDB
Found 2 hits for monomerid = 23256
TargetL-lactate dehydrogenase B chain(Homo sapiens (Human))
University Of Bristol
LigandPNGBDBM23256(1-benzyl-4-hydroxy-1H-1,2,3-triazole-5-carboxylic ...)
Affinity DataIC50: >1.00E+5nM. Assay description: An LDH enzymatic assay developed for high throughput format was used. The dehydrogenase reaction was run in the lactate to pyruvate direction and cou...
Ligand InfoPC cidPC sid
In DepthDetails ArticlePubMed
TargetL-lactate dehydrogenase(Plasmodium falciparum)
University Of Bristol
LigandPNGBDBM23256(1-benzyl-4-hydroxy-1H-1,2,3-triazole-5-carboxylic ...)
Affinity DataIC50: >1.00E+5nMpH: 7.5 T: 2°C. Assay description: An LDH enzymatic assay developed for high throughput format was used. The dehydrogenase reaction was run in the lactate to pyruvate direction and cou...
Ligand InfoPC cidPC sid
In DepthDetails ArticlePubMed