BDBM237925 US9394285, 6
SMILES OC(=O)c1c[nH]c2cc(F)c(-c3ccc(cc3)C3(O)CCC3)c(F)c12
InChI Key InChIKey=VPUNMIRZXILGLE-UHFFFAOYSA-N
Data  1 Kd  2 EC50
  Tab Delimited (TSV)   2D SDfile   Computed 3D by Vconf -m prep SDfile
Find this compound or compounds like it in BindingDB:
Activity Spreadsheet -- Enzyme Inhibition Constant Data from BindingDB
Found 3 hits for monomerid = 237925
LigandPNGBDBM237925(US9394285, 6)
Affinity DataEC50:  17.3nMpH: 7.5 T: 2°C. Assay description: The biochemical EC50 (half-maximal concentration required for full activation) of compounds for the activation of AMPK was evaluated by 33P-based ass...
Ligand InfoPC cidPC sid
In DepthDetails US Patent
LigandPNGBDBM237925(US9394285, 6)
Affinity DataEC50:  35nM. Assay description: Allosteric activation of human AMPK alpha1/beta1/gamma1 by TR-FRET assay
Ligand InfoPC cidPC sid
In DepthDetails ArticlePubMed
LigandPNGBDBM237925(US9394285, 6)
Affinity DataKd:  20nM. Assay description: Binding affinity to human BAP-tagged AMPK alpha1/beta1/gamma1 by SPR assay
Ligand InfoPC cidPC sid
In DepthDetails ArticlePubMed