BDBM239093 US10195181, Example 1.2::US9403810, 1.2
SMILES Cc1c(noc1C1=CCCCC1(C)C)C(=O)Nc1c(C)n(C)n(C2CCCCC2)c1=O
InChI Key InChIKey=DGNFKQCNOKELPI-UHFFFAOYSA-N
Data  2 IC50
  Tab Delimited (TSV)   2D SDfile   Computed 3D by Vconf -m prep SDfile
Find this compound or compounds like it in BindingDB:
Activity Spreadsheet -- Enzyme Inhibition Constant Data from BindingDB
Found 2 hits for monomerid = 239093
TargetE3 ubiquitin-protein ligase SMURF1(Homo sapiens (Human))
Novartis
US Patent
LigandPNGBDBM239093(US10195181, Example 1.2 | US9403810, 1.2)
Affinity DataIC50:  14nM. Assay description: To determine the HECT E3 ligase selectivity of the compounds, a panel of biochemical HECT E3 ligase autoubiquitinylation assays was employed (Smurf-1...
Ligand InfoPC cidPC sid
In DepthDetails US Patent
TargetE3 ubiquitin-protein ligase SMURF1 [420-757](Homo sapiens (Human))
Novartis
US Patent
LigandPNGBDBM239093(US10195181, Example 1.2 | US9403810, 1.2)
Affinity DataIC50:  14nMT: 2°C. Assay description: For the biochemical assay panel, 50 nl of the test compounds, reference compounds and buffer/DMSO control are transferred to the respective wells of ...
Ligand InfoPC cidPC sid
In DepthDetails US Patent