BDBM24008 1-benzyl-5'-(4-methoxyphenyl)-5-methyl-1,2-dihydro-3'H-spiro[indole-3,2'-[1,3,4]thiadiazole]-2-one::CHEMBL401435::thiadiazole derivative, 34
SMILES COc1ccc(cc1)C1=NNC2(S1)C(=O)N(Cc1ccccc1)c1ccc(C)cc21
InChI Key InChIKey=OYDZMCCYUDYFHU-UHFFFAOYSA-N
Data  8 IC50
  Tab Delimited (TSV)   2D SDfile   Computed 3D by Vconf -m prep SDfile
Find this compound or compounds like it in BindingDB:
Activity Spreadsheet -- Enzyme Inhibition Constant Data from BindingDB
Found 8 hits for monomerid = 24008
LigandPNGBDBM24008(1-benzyl-5'-(4-methoxyphenyl)-5-methyl-1,2-dihydro...)
Affinity DataIC50:  640nMpH: 7.5 T: 2°C. Assay description: ADAMTS-5 activity was determined using a fluorescence resonance energy transfer (FRET) assay using a QF peptide containing an aggrecanase cleavage si...
In DepthDetails ArticlePubMed
LigandPNGBDBM24008(1-benzyl-5'-(4-methoxyphenyl)-5-methyl-1,2-dihydro...)
Affinity DataIC50: >2.20E+4nMpH: 7.5 T: 2°C. Assay description: The recombinant Agg-1 proteins pretreated with the various concentrations of the compound for 10 to 15 min. The reaction was initiated by addition of...
In DepthDetails ArticlePubMed
TargetCollagenase 3(Homo sapiens (Human))
Wyeth Research
LigandPNGBDBM24008(1-benzyl-5'-(4-methoxyphenyl)-5-methyl-1,2-dihydro...)
Affinity DataIC50: >1.00E+5nMpH: 7.5 T: 2°C. Assay description: A continuous assay was used in which the substrate is a synthetic peptide containing a fluorescent group (7-methoxycoumarin), which is quenched by en...
In DepthDetails ArticlePubMed
TargetMacrophage metalloelastase(Homo sapiens (Human))
University Of Athens
Curated by ChEMBL
LigandPNGBDBM24008(1-benzyl-5'-(4-methoxyphenyl)-5-methyl-1,2-dihydro...)
Affinity DataIC50: >2.20E+4nM. Assay description: Inhibition of MMP12
In DepthDetails ArticlePubMed
LigandPNGBDBM24008(1-benzyl-5'-(4-methoxyphenyl)-5-methyl-1,2-dihydro...)
Affinity DataIC50: >2.20E+4nM. Assay description: Inhibition of ADAMTS4
In DepthDetails ArticlePubMed
TargetA disintegrin and metalloproteinase with thrombospondin motifs 5(Homo sapiens (Human))
University Of Athens
Curated by ChEMBL
LigandPNGBDBM24008(1-benzyl-5'-(4-methoxyphenyl)-5-methyl-1,2-dihydro...)
Affinity DataIC50:  640nM. Assay description: Inhibition of ADAMTS5
In DepthDetails ArticlePubMed
TargetCollagenase 3(Homo sapiens (Human))
Wyeth Research
LigandPNGBDBM24008(1-benzyl-5'-(4-methoxyphenyl)-5-methyl-1,2-dihydro...)
Affinity DataIC50: >1.00E+5nM. Assay description: Inhibition of MMP13
In DepthDetails ArticlePubMed
TargetMacrophage metalloelastase(Homo sapiens (Human))
University Of Athens
Curated by ChEMBL
LigandPNGBDBM24008(1-benzyl-5'-(4-methoxyphenyl)-5-methyl-1,2-dihydro...)
Affinity DataIC50: >2.20E+4nMpH: 7.5 T: 2°C. Assay description: A continuous assay was used in which the substrate is a synthetic peptide containing a fluorescent group (7-methoxycoumarin), which is quenched by en...
In DepthDetails ArticlePubMed