BDBM24012 5'-(4-methoxyphenyl)-6-methyl-1,2-dihydro-3'H-spiro[indole-3,2'-[1,3,4]thiadiazole]-2-one::thiadiazole derivative, 24
SMILES COc1ccc(cc1)C1=NNC2(S1)C(=O)Nc1cc(C)ccc21
InChI Key InChIKey=CCZABUCLUWARCL-UHFFFAOYSA-N
Data  1 IC50
  Tab Delimited (TSV)   2D SDfile   Computed 3D by Vconf -m prep SDfile
Find this compound or compounds like it in BindingDB:
Activity Spreadsheet -- Enzyme Inhibition Constant Data from BindingDB
Found 1 hit for monomerid = 24012
LigandPNGBDBM24012(5'-(4-methoxyphenyl)-6-methyl-1,2-dihydro-3'H-spir...)
Affinity DataIC50:  1.40E+3nM. Assay description: ADAMTS-5 activity was determined using a fluorescence resonance energy transfer (FRET) assay using a QF peptide containing an aggrecanase cleavage si...
In DepthDetails ArticlePubMed