BDBM241207 US11046688, Example 49::US9409907, 49
SMILES COc1cc(ccc1Nc1ncc2ccnc(NCC(C)(C)C)c2n1)-c1cnn(C)c1C
InChI Key InChIKey=YJSHLYBLZLAHEP-UHFFFAOYSA-N
Data  2 KI  5 IC50
  Tab Delimited (TSV)   2D SDfile   Computed 3D by Vconf -m prep SDfile
Find this compound or compounds like it in BindingDB:
Activity Spreadsheet -- Enzyme Inhibition Constant Data from BindingDB
Found 7 hits for monomerid = 241207
TargetDual specificity protein kinase TTK(Homo sapiens (Human))
The Institute Of Cancer Research
Curated by ChEMBL
LigandPNGBDBM241207(US11046688, Example 49 | US9409907, 49)
Affinity DataKi:  0.780nM. Assay description: Inhibition of full length human N-terminal 6xHis-tagged MPS1 expressed in baculovirus expression system using 5FAM-H236 peptide as substrate after 60...
Ligand InfoPC cidPC sid
In DepthDetails ArticlePubMed
TargetCyclin-A2/Cyclin-dependent kinase 2(Homo sapiens (Human))
The Institute Of Cancer Research
Curated by ChEMBL
LigandPNGBDBM241207(US11046688, Example 49 | US9409907, 49)
Affinity DataKi:  1.50E+3nM. Assay description: Inhibition of full length human N-terminal His-tagged CDK2/cyclinA expressed in baculovirus expression system using 5FAM- peptide18 as substrate afte...
Ligand InfoPC cidPC sid
In DepthDetails ArticlePubMed
TargetDual specificity protein kinase TTK(Homo sapiens (Human))
The Institute Of Cancer Research
Curated by ChEMBL
LigandPNGBDBM241207(US11046688, Example 49 | US9409907, 49)
Affinity DataIC50:  79nM. Assay description: Inhibition of full length human N-terminal 6xHis-tagged MPS1 expressed in baculovirus expression system using 5FAM-H236 peptide as substrate after 60...
Ligand InfoPC cidPC sid
In DepthDetails ArticlePubMed
TargetDual specificity protein kinase TTK(Homo sapiens (Human))
The Institute Of Cancer Research
Curated by ChEMBL
LigandPNGBDBM241207(US11046688, Example 49 | US9409907, 49)
Affinity DataIC50:  5nM. Assay description: The enzyme reaction (total volume 10 μl) was carried out in black 384-well low volume plates containing full length MPS1 (12.5 nM or 3 nM), fluo...
Ligand InfoPC cidPC sid
TargetDual specificity protein kinase TTK(Homo sapiens (Human))
The Institute Of Cancer Research
Curated by ChEMBL
LigandPNGBDBM241207(US11046688, Example 49 | US9409907, 49)
Affinity DataIC50:  95nM. Assay description: Inhibition of MPS1 autophosphorylation at Thr33/Ser37 in human HCT116 cells after 2 hrs by MSD assay
Ligand InfoPC cidPC sid
In DepthDetails ArticlePubMed
TargetDual specificity protein kinase TTK(Homo sapiens (Human))
The Institute Of Cancer Research
Curated by ChEMBL
LigandPNGBDBM241207(US11046688, Example 49 | US9409907, 49)
Affinity DataIC50:  5nMpH: 7.0 T: 2°C. Assay description: The enzyme reaction (total volume 10 μl) was carried out in black 384-well low volume plates containing full length MPS1 (12.5 nM or 3 nM), fluo...
Ligand InfoPC cidPC sid
In DepthDetails US Patent
TargetCyclin-A2/Cyclin-dependent kinase 2(Homo sapiens (Human))
The Institute Of Cancer Research
Curated by ChEMBL
LigandPNGBDBM241207(US11046688, Example 49 | US9409907, 49)
Affinity DataIC50:  3.00E+3nM. Assay description: Inhibition of full length human N-terminal His-tagged CDK2/cyclinA expressed in baculovirus expression system using 5FAM- peptide18 as substrate afte...
Ligand InfoPC cidPC sid
In DepthDetails ArticlePubMed