BDBM242741 US10030025, Compound 2::US10836768, Cpd no 2::US11731974, Compound 2::US9422299, 2::US9987274, Compound 2
SMILES CCc1nsc(n1)-c1nnc2[C@@H](C)N(CCn12)C(=O)c1ccc(F)cc1
InChI Key InChIKey=UOMUYZXEONWAOD-SNVBAGLBSA-N
Data  16 KI  6 IC50
  Tab Delimited (TSV)   2D SDfile   Computed 3D by Vconf -m prep SDfile
Find this compound or compounds like it in BindingDB:
Activity Spreadsheet -- Enzyme Inhibition Constant Data from BindingDB
Found 22 hits for monomerid = 242741
TargetNeuromedin-K receptor(Homo sapiens (Human))
Euroscreen
US Patent
LigandPNGBDBM242741(US10030025, Compound 2 | US10836768, Cpd no 2 | US...)
Affinity DataKi:  15nMpH: 7.4Assay Description:The affinity of compounds of the invention for the human NK-3 receptor was determined by measuring the ability of compounds of the invention to compe...
Ligand InfoPC cidPC sid
In DepthDetails US Patent
TargetNeuromedin-K receptor(Homo sapiens (Human))
Euroscreen
US Patent
LigandPNGBDBM242741(US10030025, Compound 2 | US10836768, Cpd no 2 | US...)
Affinity DataKi:  15nM. Assay description: The ability of compounds of the invention to inhibit the binding of the NK-3 receptor selective antagonist3 H-SB222200 was assessed by an in vitro ra...
Ligand InfoPC cidPC sid
In DepthDetails US Patent
TargetNeuromedin-K receptor(Homo sapiens (Human))
Euroscreen
US Patent
LigandPNGBDBM242741(US10030025, Compound 2 | US10836768, Cpd no 2 | US...)
Affinity DataKi:  15nM. Assay description: The ability of compounds of the invention to inhibit the binding of the NK-3 receptor selective antagonist3 H-SB222200 was assessed by an in vitro ra...
Ligand InfoPC cidPC sid
In DepthDetails US Patent
TargetNeuromedin-K receptor(Homo sapiens (Human))
Euroscreen
US Patent
LigandPNGBDBM242741(US10030025, Compound 2 | US10836768, Cpd no 2 | US...)
Affinity DataKi:  15nM. Assay description: The affinity of compounds of the invention for the human NK-3 receptor was determined by measuring the ability of compounds of the invention to compe...
Ligand InfoPC cidPC sid
In DepthDetails US Patent
TargetNeuromedin-K receptor(Homo sapiens (Human))
Euroscreen
US Patent
LigandPNGBDBM242741(US10030025, Compound 2 | US10836768, Cpd no 2 | US...)
Affinity DataKi:  15nM. Assay description: Human NK-3: The ability of compounds of the invention to inhibit the binding of the NK-3 receptor selective antagonist 3H-SB222200 was assessed by an...
Ligand InfoPC cidPC sid
In DepthDetails US Patent
TargetNeuromedin-K receptor(Homo sapiens (Human))
Euroscreen
US Patent
LigandPNGBDBM242741(US10030025, Compound 2 | US10836768, Cpd no 2 | US...)
Affinity DataKi:  15nMpH: 7.4Assay Description:The affinity of compounds of the invention for the human NK-3 receptor was determined by measuring the ability of compounds of the invention to compe...
Ligand InfoPC cidPC sid
In DepthDetails US Patent
TargetSubstance-P receptor(Homo sapiens (Human))
Ogeda
US Patent
LigandPNGBDBM242741(US10030025, Compound 2 | US10836768, Cpd no 2 | US...)
Affinity DataKi:  2.38E+4nM. Assay description: The affinity of compounds of the invention for the NK-1 receptor was evaluated in CHO recombinant cells which express the human NK-1 receptor. Membra...
Ligand InfoPC cidPC sid
In DepthDetails US Patent
TargetSubstance-P receptor(Homo sapiens (Human))
Ogeda
US Patent
LigandPNGBDBM242741(US10030025, Compound 2 | US10836768, Cpd no 2 | US...)
Affinity DataKi:  2.38E+4nM ΔG°:  -6.30kcal/molepH: 7.4 T: 2°C. Assay description: The affinity of compounds of the invention for the NK-1 receptor was evaluated in CHO recombinant cells which express the human NK-1 receptor. Membra...
Ligand InfoPC cidPC sid
In DepthDetails US Patent
TargetSubstance-P receptor(Homo sapiens (Human))
Ogeda
US Patent
LigandPNGBDBM242741(US10030025, Compound 2 | US10836768, Cpd no 2 | US...)
Affinity DataKi:  2.38E+4nM. Assay description: Human NK-1: The affinity of compounds of the invention for the NK-1 receptor was evaluated in CHO recombinant cells which express the human NK-1 rece...
Ligand InfoPC cidPC sid
In DepthDetails US Patent
TargetSubstance-P receptor(Homo sapiens (Human))
Ogeda
US Patent
LigandPNGBDBM242741(US10030025, Compound 2 | US10836768, Cpd no 2 | US...)
Affinity DataKi:  2.38E+4nM ΔG°:  -6.30kcal/molepH: 7.4 T: 2°C. Assay description: The affinity of compounds of the invention for the NK-1 receptor was evaluated in CHO recombinant cells which express the human NK-1 receptor. Membra...
Ligand InfoPC cidPC sid
In DepthDetails US Patent
TargetSubstance-P receptor(Homo sapiens (Human))
Ogeda
US Patent
LigandPNGBDBM242741(US10030025, Compound 2 | US10836768, Cpd no 2 | US...)
Affinity DataKi:  2.38E+4nM. Assay description: The affinity of compounds of the invention for the NK-1 receptor was evaluated in CHO recombinant cells which express the human NK-1 receptor. Membra...
Ligand InfoPC cidPC sid
In DepthDetails US Patent
TargetSubstance-K receptor(Homo sapiens (Human))
Ogeda
US Patent
LigandPNGBDBM242741(US10030025, Compound 2 | US10836768, Cpd no 2 | US...)
Affinity DataKi: >3.00E+4nM. Assay description: Human NK-2 The affinity of compounds of the invention for the NK-2 receptor was evaluated in CHO recombinant cells which express the human NK-2 recep...
Ligand InfoPC cidPC sid
In DepthDetails US Patent
TargetSubstance-K receptor(Homo sapiens (Human))
Ogeda
US Patent
LigandPNGBDBM242741(US10030025, Compound 2 | US10836768, Cpd no 2 | US...)
Affinity DataKi: >3.00E+4nM ΔG°: >-6.17kcal/molepH: 7.4 T: 2°C. Assay description: The affinity of compounds of the invention for the NK-2 receptor was evaluated in CHO recombinant cells which express the human NK-2 receptor. Membra...
Ligand InfoPC cidPC sid
In DepthDetails US Patent
TargetSubstance-K receptor(Homo sapiens (Human))
Ogeda
US Patent
LigandPNGBDBM242741(US10030025, Compound 2 | US10836768, Cpd no 2 | US...)
Affinity DataKi: >3.00E+4nM. Assay description: The affinity of compounds of the invention for the NK-2 receptor was evaluated in CHO recombinant cells which express the human NK-2 receptor. Membra...
Ligand InfoPC cidPC sid
In DepthDetails US Patent
TargetSubstance-K receptor(Homo sapiens (Human))
Ogeda
US Patent
LigandPNGBDBM242741(US10030025, Compound 2 | US10836768, Cpd no 2 | US...)
Affinity DataKi: >3.00E+4nM. Assay description: The affinity of compounds of the invention for the NK-2 receptor was evaluated in CHO recombinant cells which express the human NK-2 receptor. Membra...
Ligand InfoPC cidPC sid
In DepthDetails US Patent
TargetSubstance-K receptor(Homo sapiens (Human))
Ogeda
US Patent
LigandPNGBDBM242741(US10030025, Compound 2 | US10836768, Cpd no 2 | US...)
Affinity DataKi: >3.00E+4nM ΔG°: >-6.17kcal/molepH: 7.4 T: 2°C. Assay description: The affinity of compounds of the invention for the NK-2 receptor was evaluated in CHO recombinant cells which express the human NK-2 receptor. Membra...
Ligand InfoPC cidPC sid
In DepthDetails US Patent
TargetNeuromedin-K receptor(Homo sapiens (Human))
Euroscreen
US Patent
LigandPNGBDBM242741(US10030025, Compound 2 | US10836768, Cpd no 2 | US...)
Affinity DataIC50:  12nM. Assay description: Changes in intracellular calcium levels are a recognized indicator of G protein-coupled receptor activity. The efficacy of compounds of the invention...
Ligand InfoPC cidPC sid
In DepthDetails US Patent
TargetPotassium voltage-gated channel subfamily H member 2(Homo sapiens (Human))
Euroscreen
US Patent
LigandPNGBDBM242741(US10030025, Compound 2 | US10836768, Cpd no 2 | US...)
Affinity DataIC50:  3.20E+4nM. Assay description: The hERG inhibition study aims at quantifying the in vitro effects of compounds of the invention on the potassium-selective IKr current generated in ...
Ligand InfoPC cidPC sid
In DepthDetails US Patent
TargetNeuromedin-K receptor(Homo sapiens (Human))
Euroscreen
US Patent
LigandPNGBDBM242741(US10030025, Compound 2 | US10836768, Cpd no 2 | US...)
Affinity DataIC50:  12nM. Assay description: Chinese Hamster Ovary recombinant cells expressing the human NK-3 receptor and a construct that encodes the photoprotein apoaequorin were used for th...
Ligand InfoPC cidPC sid
In DepthDetails US Patent
TargetPotassium voltage-gated channel subfamily H member 2(Homo sapiens (Human))
Euroscreen
US Patent
LigandPNGBDBM242741(US10030025, Compound 2 | US10836768, Cpd no 2 | US...)
Affinity DataIC50:  3.20E+4nM. Assay description: The human ether-a-go-go related gene (hERG) encodes the inward rectifying voltage gated potassium channel in the heart (IKr) which is involved in car...
Ligand InfoPC cidPC sid
In DepthDetails US Patent
TargetPotassium voltage-gated channel subfamily H member 2(Homo sapiens (Human))
Euroscreen
US Patent
LigandPNGBDBM242741(US10030025, Compound 2 | US10836768, Cpd no 2 | US...)
Affinity DataIC50:  3.20E+4nM. Assay description: The human ether-a-go-go related gene (hERG) encodes the inward rectifying voltage gated potassium channel in the heart (Igr) which is involved in car...
Ligand InfoPC cidPC sid
In DepthDetails US Patent
TargetNeuromedin-K receptor(Homo sapiens (Human))
Euroscreen
US Patent
LigandPNGBDBM242741(US10030025, Compound 2 | US10836768, Cpd no 2 | US...)
Affinity DataIC50:  12nM. Assay description: Changes in intracellular calcium levels are a recognized indicator of G protein-coupled receptor activity. The efficacy of compounds of the invention...
Ligand InfoPC cidPC sid
In DepthDetails US Patent