BDBM24496 3-(3-fluoro-4-{[2-(pyrrolidin-1-ylcarbonyl)thieno[3,2-b]pyridin-7-yl]oxy}phenyl)-1-(2-phenylacetyl)thiourea::thieno[3,2-b]pyridine-based inhibitor, 8f
SMILES Fc1cc(NC(=S)NC(=O)Cc2ccccc2)ccc1Oc1ccnc2cc(sc12)C(=O)N1CCCC1
InChI Key InChIKey=JTRYIRPUUMAXSL-UHFFFAOYSA-N
Data  3 IC50
  Tab Delimited (TSV)   2D SDfile   Computed 3D by Vconf -m prep SDfile
Find this compound or compounds like it in BindingDB:
Activity Spreadsheet -- Enzyme Inhibition Constant Data from BindingDB
Found 3 hits for monomerid = 24496
TargetHepatocyte growth factor receptor(Homo sapiens (Human))
Methylgene
LigandPNGBDBM24496(3-(3-fluoro-4-{[2-(pyrrolidin-1-ylcarbonyl)thieno[...)
Affinity DataIC50:  54nMpH: 7.5 T: 2°C. Assay description: Inhibition of kinase activity was measured in a DELFIA assay (Perkin-Elmer). The substrate poly (Glu4, Tyr) was immobilized onto black high-binding p...
In DepthDetails ArticlePubMed
TargetHepatocyte growth factor receptor(Homo sapiens (Human))
Methylgene
LigandPNGBDBM24496(3-(3-fluoro-4-{[2-(pyrrolidin-1-ylcarbonyl)thieno[...)
Affinity DataIC50:  54nM. Assay description: Inhibition of human c-MET
In DepthDetails ArticlePubMed
TargetVascular endothelial growth factor receptor 2(Homo sapiens (Human))
Methylgene
LigandPNGBDBM24496(3-(3-fluoro-4-{[2-(pyrrolidin-1-ylcarbonyl)thieno[...)
Affinity DataIC50:  9nM. Assay description: Inhibition of kinase activity was measured in a DELFIA assay (Perkin-Elmer). The substrate poly (Glu4, Tyr) was immobilized onto black high-binding p...
In DepthDetails ArticlePubMed