BDBM24528 (2E,5E)-2-(1,3-benzothiazol-2-ylimino)-5-[(3-nitrophenyl)methylidene]-1,3-thiazolidin-4-one::Benzothiazolyl- analogue, 15
SMILES [O-][N+](=O)c1cccc(\C=C2\S\C(NC2=O)=N\c2nc3ccccc3s2)c1
InChI Key InChIKey=YDBTWNSZSNEURJ-NTEUORMPSA-N
Data  1 KI
  Tab Delimited (TSV)   2D SDfile   Computed 3D by Vconf -m prep SDfile
Find this compound or compounds like it in BindingDB:
Activity Spreadsheet -- Enzyme Inhibition Constant Data from BindingDB
Found 1 hit for monomerid = 24528
TargetTyrosine-protein phosphatase non-receptor type 11(Homo sapiens (Human))
Aristotle University
LigandPNGBDBM24528((2E,5E)-2-(1,3-benzothiazol-2-ylimino)-5-[(3-nitro...)
Affinity DataKi:  2.87E+4nM ΔG°:  -6.19kcal/molepH: 7.0 T: 2°C. Assay description: SHP-2 inhibitory activity was tested using human recombinant GST-fusion SHP-2 (Calbiochem). Test compound was preincubated with enzyme mixture before...
In DepthDetails ArticlePubMed