BDBM245489 US9428503, 16
SMILES CN(C)CCCOc1ccc(cn1)-c1ccc2ncc3n(C)c(=O)n([C@@H]4CCCOC4)c3c2c1
InChI Key InChIKey=ABKGTFFKSJEJIQ-HXUWFJFHSA-N
Data  7 IC50
  Tab Delimited (TSV)   2D SDfile   Computed 3D by Vconf -m prep SDfile
Find this compound or compounds like it in BindingDB:
Activity Spreadsheet -- Enzyme Inhibition Constant Data from BindingDB
Found 7 hits for monomerid = 245489
TargetSerine-protein kinase ATM(Homo sapiens (Human))
Astrazeneca
US Patent
LigandPNGBDBM245489(US9428503, 16)
Affinity DataIC50:  0.935nMT: 2°C. Assay description: Assay a) HT29 cells (ECACC #85061109) were seeded into 384 well assay plates (Costar #3712) at a density of 3500 cells/well in 40 μl EMEM medium c...
Ligand InfoPC cidPC sid
In DepthDetails US Patent
TargetSerine/threonine-protein kinase ATR(Homo sapiens (Human))
Astrazeneca
US Patent
LigandPNGBDBM245489(US9428503, 16)
Affinity DataIC50: >2.28E+4nMT: 2°C. Assay description: Assay b) HT29 cells (ECACC #85061109) were seeded into 384 well assay plates (Costar #3712) at a density of 6000 cells/well in 40 μl EMEM medium c...
Ligand InfoPC cidPC sid
In DepthDetails US Patent
LigandPNGBDBM245489(US9428503, 16)
Affinity DataIC50:  311nMT: 2°C. Assay description: Assay c) BT474 cells (human breast ductal carcinoma, ATCC HTB-20) were seeded into black 384 well plates (Costar, #3712) at a density of 5600 cells/w...
Ligand InfoPC cidPC sid
In DepthDetails US Patent
TargetPotassium voltage-gated channel subfamily H member 2(Homo sapiens (Human))
Astrazeneca
Curated by ChEMBL
LigandPNGBDBM245489(US9428503, 16)
Affinity DataIC50: >3.30E+4nM. Assay description: Inhibition of human ERG by electrophysiology assay
Ligand InfoPC cidPC sid
In DepthDetails ArticlePubMed
TargetSerine-protein kinase ATM(Homo sapiens (Human))
Astrazeneca
US Patent
LigandPNGBDBM245489(US9428503, 16)
Affinity DataIC50:  0.940nM. Assay description: Inhibition of ATM autophosphorylation at Ser1981 in human HT29 cells preincubated for 1 hr followed by X ray irradiation and measured after 1 hr by H...
Ligand InfoPC cidPC sid
In DepthDetails ArticlePubMed
TargetSerine/threonine-protein kinase ATR(Homo sapiens (Human))
Astrazeneca
US Patent
LigandPNGBDBM245489(US9428503, 16)
Affinity DataIC50: >2.30E+4nM. Assay description: Inhibition of ATR in human HT29 cells assessed as decrease in Chk1 phosphorylation at Ser 345 preincubated for 1 hr followed by 4NQO addition and mea...
Ligand InfoPC cidPC sid
In DepthDetails ArticlePubMed
TargetSerine/threonine-protein kinase mTOR(Homo sapiens (Human))
Astrazeneca
US Patent
LigandPNGBDBM245489(US9428503, 16)
Affinity DataIC50:  714nMT: 2°C. Assay description: Assay d) MDA-MB-468 cells (human breast adenocarcinoma ##ATCC HTB 132) were seeded at 1500 cells/well in 40 μl of DMEM containing 10% FBS and 1% g...
Ligand InfoPC cidPC sid
In DepthDetails US Patent