BDBM246831 Cis-11-((6-hydroxyhexyl)oxy)-10-methoxy-3,3-dimethyl-7-oxo-1,2,3,3a,7,12b-hexahydrocyclopenta[c]pyrido[2,1-a]isoquinoline-6-carboxylic acid::US10053461, 22
SMILES COc1cc-2c(cc1OCCCCCCO)[C@H]1CCC(C)(C)[C@H]1n1cc(C(O)=O)c(=O)cc-21
InChI Key InChIKey=RVRNODHNEUXIJP-GYCJOSAFSA-N
Data  1 IC50
  Tab Delimited (TSV)   2D SDfile   Computed 3D by Vconf -m prep SDfile
Find this compound or compounds like it in BindingDB:
Activity Spreadsheet -- Enzyme Inhibition Constant Data from BindingDB
Found 1 hit for monomerid = 246831
TargetLarge envelope protein(Hepatitis B virus)
Hoffmann-La Roche
US Patent
LigandPNGBDBM246831(Cis-11-((6-hydroxyhexyl)oxy)-10-methoxy-3,3-dimeth...)
Affinity DataIC50:  1nMT: 2°C. Assay description: HepG2.2.15 cells were seeded in duplicate into white, 96-well plates at 1.5×104 cells/well. The cells were treated with a three-fold serial dilution ...
Ligand InfoPC cidPC sid
In DepthDetails US Patent