BDBM247168 1-(5-Cyclopropylthiazol-2-yl)ethanone::US9701672, 22
SMILES FC(F)(F)CCCCc1ccc(cc1)[C@@]1(CC(c2ccn(CC3CC3)n2)=C(c2nnn[nH]2)C(=O)N1)C(F)(F)F
InChI Key
Data  1 IC50
  Tab Delimited (TSV)   2D SDfile   Computed 3D by Vconf -m prep SDfile
Find this compound or compounds like it in BindingDB:
Activity Spreadsheet -- Enzyme Inhibition Constant Data from BindingDB
Found 1 hit for monomerid = 247168
TargetAlpha-1,6-mannosyl-glycoprotein 2-beta-N-acetylglucosaminyltransferase(Homo sapiens (Human))
Bristol-Myers Squibb
US Patent
LigandPNGBDBM247168(1-(5-Cyclopropylthiazol-2-yl)ethanone | US9701672,...)
Affinity DataIC50:  1.20nMpH: 7.4Assay Description:The MGAT enzyme reactions were performed in Corning FALCONŽ 96-well polypropylene plates, in a total volume of 60 μL of 50 mM potassium phosphat...
Ligand InfoPC cidPC sid
In DepthDetails US Patent