BDBM24749 (2S)-6-amino-N-[(1S)-5-amino-1-{[(2S)-1-(1H-indol-3-yl)-3-oxopropan-2-yl]carbamoyl}pentyl]-2-(1-phenylacetamido)hexanamide::Capped tripeptide aldehyde inhibitor, 37
SMILES NCCCC[C@H](NC(=O)Cc1ccccc1)C(=O)N[C@@H](CCCCN)C(=O)N[C@@H](Cc1c[nH]c2ccccc12)C=O
InChI Key InChIKey=NPTUZPVDXLUVJU-WIRXVTQYSA-N
Data  1 KI  1 IC50
  Tab Delimited (TSV)   2D SDfile   Computed 3D by Vconf -m prep SDfile
Find this compound or compounds like it in BindingDB:
Activity Spreadsheet -- Enzyme Inhibition Constant Data from BindingDB
Found 1 hit for monomerid = 24749
TargetGenome polyprotein [1424-1463]/[1502-1685](West Nile virus (WNV))
University Of Queensland
LigandPNGBDBM24749((2S)-6-amino-N-[(1S)-5-amino-1-{[(2S)-1-(1H-indol-...)
Affinity DataKi:  4.60E+3nM ΔG°:  -7.57kcal/mole IC50:  2.57E+4nMpH: 9.5 T: 2°C. Assay description: Inhibition of WNV protease activity was measured using recombinant WNV protease, which first incubated with inhibitor in 96-well plates. Catalysis wa...
In DepthDetails ArticlePubMed