BDBM249411 US10537571, Compound 128::US10912774, Compound 128::US9434697, 128::US9730931, Compound 128
SMILES COc1cc(OC)c(Cl)c(NC(=O)N(C)c2cc(Nc3ccccc3NC(=O)C#CC)ncn2)c1Cl
InChI Key InChIKey=TXZVKYMXSUDFAU-UHFFFAOYSA-N
Data  8 IC50
  Tab Delimited (TSV)   2D SDfile   Computed 3D by Vconf -m prep SDfile
Find this compound or compounds like it in BindingDB:
Activity Spreadsheet -- Enzyme Inhibition Constant Data from BindingDB
Found 8 hits for monomerid = 249411
TargetFibroblast growth factor receptor 4(Homo sapiens (Human))
Eisai R&D Management
US Patent
LigandPNGBDBM249411(US10537571, Compound 128 | US10912774, Compound 12...)
Affinity DataIC50:  33nMpH: 7.5 T: 2°C. Assay description: Compounds were profiled for FGFR inhibition activity at Reaction Biology Corporation (Malvern, Pa.) with their Kinase HotSpot assay. See, Anastassiad...
Ligand InfoPC cidPC sid
In DepthDetails US Patent
TargetFibroblast growth factor receptor 1(Homo sapiens (Human))
Eisai R&D Management
US Patent
LigandPNGBDBM249411(US10537571, Compound 128 | US10912774, Compound 12...)
Affinity DataIC50:  1.68E+3nMpH: 7.5 T: 2°C. Assay description: Compounds were profiled for FGFR inhibition activity at Reaction Biology Corporation (Malvern, Pa.) with their Kinase HotSpot assay. See, Anastassiad...
Ligand InfoPC cidPC sid
In DepthDetails US Patent
TargetFibroblast growth factor receptor 4(Homo sapiens (Human))
Eisai R&D Management
US Patent
LigandPNGBDBM249411(US10537571, Compound 128 | US10912774, Compound 12...)
Affinity DataIC50:  33nM. Assay description: Purified, recombinant FGFR4 was pre-incubated with 10 μM compound overnight at 4° C., or for 1 hour at room temperature. Following pre-incubatio...
Ligand InfoPC cidPC sid
In DepthDetails US Patent
TargetFibroblast growth factor receptor 1(Homo sapiens (Human))
Eisai R&D Management
US Patent
LigandPNGBDBM249411(US10537571, Compound 128 | US10912774, Compound 12...)
Affinity DataIC50:  1.68E+3nM. Assay description: Recombinant FGFR1 (2.5 nM), FGFR2 (1 nM), FGFR3 (5 nM), or FGFR4 (12 nM) (Invitrogen™) was prepared as a mixture with substrate KKKSPGEYVNIEFG (SEQ I...
Ligand InfoPC cidPC sid
In DepthDetails US Patent
TargetFibroblast growth factor receptor 4(Homo sapiens (Human))
Eisai R&D Management
US Patent
LigandPNGBDBM249411(US10537571, Compound 128 | US10912774, Compound 12...)
Affinity DataIC50:  33nM. Assay description: Recombinant FGFR1 (2.5 nM), FGFR2 (1 nM), FGFR3 (5 nM), or FGFR4 (12 nM) was prepared as a mixture with substrate KKKSPGEYVNIEFG (SEQ ID NO:1) (20 μ...
Ligand InfoPC cidPC sid
In DepthDetails US Patent
TargetFibroblast growth factor receptor 1(Homo sapiens (Human))
Eisai R&D Management
US Patent
LigandPNGBDBM249411(US10537571, Compound 128 | US10912774, Compound 12...)
Affinity DataIC50:  1.68E+3nM. Assay description: Recombinant FGFR1 (2.5 nM), FGFR2 (1 nM), FGFR3 (5 nM), or FGFR4 (12 nM) was prepared as a mixture with substrate KKKSPGEYVNIEFG (SEQ ID NO:1) (20 μ...
Ligand InfoPC cidPC sid
In DepthDetails US Patent
TargetFibroblast growth factor receptor 4(Homo sapiens (Human))
Eisai R&D Management
US Patent
LigandPNGBDBM249411(US10537571, Compound 128 | US10912774, Compound 12...)
Affinity DataIC50:  33nM. Assay description: Recombinant FGFR1 (2.5 nM), FGFR2 (1 nM), FGFR3 (5 nM), or FGFR4 (12 nM) (Invitrogen™) was prepared as a mixture with substrate KKKSPGEYVNIEFG (SEQ I...
Ligand InfoPC cidPC sid
In DepthDetails US Patent
TargetFibroblast growth factor receptor 1(Homo sapiens (Human))
Eisai R&D Management
US Patent
LigandPNGBDBM249411(US10537571, Compound 128 | US10912774, Compound 12...)
Affinity DataIC50:  1.68E+3nM. Assay description: Recombinant FGFR1 (2.5 nM), FGFR2 (1 nM), FGFR3 (5 nM), or FGFR4 (12 nM) (Invitrogen™) was prepared as a mixture with substrate KKKSPGEYVNIEFG (...
Ligand InfoPC cidPC sid
In DepthDetails US Patent