BDBM255483 US10828301, Compound R926791::US9499493, R926791
SMILES COc1cc(Nc2ncc(F)c(Nc3ccc4OCCOc4c3)n2)cc(OC)c1
InChI Key InChIKey=RRBYUJPOUQXQNN-UHFFFAOYSA-N
Data  2 IC50
  Tab Delimited (TSV)   2D SDfile   Computed 3D by Vconf -m prep SDfile
Find this compound or compounds like it in BindingDB:
Activity Spreadsheet -- Enzyme Inhibition Constant Data from BindingDB
Found 2 hits for monomerid = 255483
TargetTyrosine-protein kinase SYK(Homo sapiens (Human))
Rigel Pharmceuticals
US Patent
LigandPNGBDBM255483(US10828301, Compound R926791 | US9499493, R926791)
Affinity DataIC50:  207nM. Assay description: Several 2,4-pyrimidinediamine compounds were tested for the ability to inhibit Syk kinase catalyzed phosphorylation of a peptide substrate in a bioch...
Ligand InfoPC cidPC sid
In DepthDetails US Patent
TargetTyrosine-protein kinase SYK(Homo sapiens (Human))
Rigel Pharmceuticals
US Patent
LigandPNGBDBM255483(US10828301, Compound R926791 | US9499493, R926791)
Affinity DataIC50:  207nMpH: 7.4 T: 2°C. Assay description: Several 2,4-pyrimidinediamine compounds were tested for the ability to inhibit Syk kinase catalyzed phosphorylation of a peptide substrate in a bioch...
Ligand InfoPC cidPC sid
In DepthDetails US Patent