BDBM2593 (Arylindolyl)maleimide deriv. 15::3-(1-methyl-1H-indol-3-yl)-4-(1-propyl-1H-indol-3-yl)-2,5-dihydro-1H-pyrrole-2,5-dione::ROCHE screening, 42
SMILES CCCn1cc(C2=C(C(=O)NC2=O)c2cn(C)c3ccccc23)c2ccccc12
InChI Key InChIKey=NMPSBQCWPUSRMH-UHFFFAOYSA-N
Data  2 IC50
  Tab Delimited (TSV)   2D SDfile   Computed 3D by Vconf -m prep SDfile
Find this compound or compounds like it in BindingDB:
Activity Spreadsheet -- Enzyme Inhibition Constant Data from BindingDB
Found 2 hits for monomerid = 2593
TargetSerine/threonine-protein kinase TBK1(Homo sapiens (Human))
Technical University Of Dortmund
LigandPNGBDBM2593((Arylindolyl)maleimide deriv. 15 | 3-(1-methyl-1H-...)
Affinity DataIC50:  3.97E+3nM. Assay description: IC50 determinations for TBK1 were performed with the KinEASE-STK assay from Cisbio according to the manufacturer's instructions. A biotinylated s...
In DepthDetails ArticlePubMed
TargetProtein kinase C beta type(Rattus norvegicus (rat))
Roche Products
LigandPNGBDBM2593((Arylindolyl)maleimide deriv. 15 | 3-(1-methyl-1H-...)
Affinity DataIC50:  480nMpH: 7.5 T: 2°C. Assay description: The activity of PKC, activated by phosphatidylerine and Ca2+, is measured by its ability to transfer phosphate from [gamma-32P]ATP to lysine-rich his...
In DepthDetails ArticlePubMed