BDBM260435 US9527839, 23
SMILES OC[C@H]1OC[C@@H](C[C@@H]1O)Oc1nc2cc(c(Cl)cc2[nH]1)-c1ccc(cc1)-c1ccc(cc1)-c1nnn[nH]1
InChI Key InChIKey=YMCJXGJTMOBZJD-PUZWTLIVSA-N
Data  1 EC50
  Tab Delimited (TSV)   2D SDfile   Computed 3D by Vconf -m prep SDfile
Find this compound or compounds like it in BindingDB:
Activity Spreadsheet -- Enzyme Inhibition Constant Data from BindingDB
Found 1 hit for monomerid = 260435
LigandPNGBDBM260435(US9527839, 23)
Affinity DataEC50:  18nMpH: 7.3 T: 2°C. Assay description: The in vitro AMPK activation assay is performed in a volume of 30 ul in a 384-well plate. Enzyme reactions were assembled in the microtiter plate by ...
Ligand InfoPC cidPC sid
In DepthDetails US Patent