BDBM260440 US9527839, 36
SMILES OC[C@H]1OC[C@@H](C[C@@H]1O)Oc1nc2c(F)c(c(F)cc2[nH]1)-c1ccc(cc1)-c1ccc(cc1)C1CNCCO1
InChI Key
Data  1 EC50
  Tab Delimited (TSV)   2D SDfile   Computed 3D by Vconf -m prep SDfile
Find this compound or compounds like it in BindingDB:
Activity Spreadsheet -- Enzyme Inhibition Constant Data from BindingDB
Found 1 hit for monomerid = 260440
LigandPNGBDBM260440(US9527839, 36)
Affinity DataEC50:  3nMpH: 7.3 T: 2°C. Assay description: The in vitro AMPK activation assay is performed in a volume of 30 ul in a 384-well plate. Enzyme reactions were assembled in the microtiter plate by ...
Ligand InfoPC cidPC sid
In DepthDetails US Patent