BDBM260451 US9527839, 50
SMILES CC(C)(O)Cc1cnn(c1)-c1ccc(cc1)-c1ccc(cc1)-c1c(F)cc2[nH]c(O[C@H]3CO[C@H](CO)[C@@H](O)C3)nc2c1F
InChI Key
Data  1 EC50
  Tab Delimited (TSV)   2D SDfile   Computed 3D by Vconf -m prep SDfile
Find this compound or compounds like it in BindingDB:
Activity Spreadsheet -- Enzyme Inhibition Constant Data from BindingDB
Found 1 hit for monomerid = 260451
LigandPNGBDBM260451(US9527839, 50)
Affinity DataEC50:  7nMpH: 7.3 T: 2°C. Assay description: The in vitro AMPK activation assay is performed in a volume of 30 ul in a 384-well plate. Enzyme reactions were assembled in the microtiter plate by ...
Ligand InfoPC cidPC sid
In DepthDetails US Patent